Reaction Details
TargetP2X purinoceptor 3
LigandBDBM106178
Substrate/Competitorn/a
Meas. Tech.Inhibiton Assay
IC50 2±n/a nM
Citation Kai, HTaoda, YEndoh, TAsahi, KTobinaga, H Pyrolinone derivative and pharmaceutical composition comprising the same US Patent US8575197 Publication Date 11/5/2013
 
P2X purinoceptor 3
Name:P2X purinoceptor 3
Type:Protein
Mol. Mass.:44292.02
Organism:Homo sapiens (Human)
Description:P56373
Residue:397
BDBM106178
NameBDBM106178
Synonyms:US8575197, II-091
TypeSmall organic molecule
Emp. Form.C27H26N4O3S
Mol. Mass.486.585
SMILESCC(C)c1[nH]nc2C(=O)N(C(c12)c1ccccc1C(=O)NCCO)c1ccc(cc1)-c1ccsc1