Reaction Details
TargetP2X purinoceptor 3
LigandBDBM106341
Substrate/Competitorn/a
Meas. Tech.Inhibiton Assay
IC50 2±n/a nM
Citation Kai, HTaoda, YEndoh, TAsahi, KTobinaga, H Pyrolinone derivative and pharmaceutical composition comprising the same US Patent US8575197 Publication Date 11/5/2013
 
P2X purinoceptor 3
Name:P2X purinoceptor 3
Type:Protein
Mol. Mass.:44292.02
Organism:Homo sapiens (Human)
Description:P56373
Residue:397
BDBM106341
NameBDBM106341
Synonyms:US8575197, II-254
TypeSmall organic molecule
Emp. Form.C25H24N4O2S
Mol. Mass.444.549
SMILESCOc1ccccc1C1N(C(=O)c2n[nH]c(c12)C(C)(C)C)c1ccc(nc1)-c1ccsc1