Reaction Details
TargetHistone deacetylase 2
LigandBDBM19149
Substrate/Competitorn/a
Meas. Tech.In vitro HDACs Inhibition Fluorescence Assay
Temperature310.15±n/a K
IC50 256.4±2.1 nM
Commentsextracted
Citation Zhang, YLiu, CChou, CJWang, XJia, YXu, W Design and synthesis of a tetrahydroisoquinoline-based hydroxamate derivative (ZYJ-34v), an oral active histone deacetylase inhibitor with potent antitumor activity. Chem Biol Drug Des82:125-30 (2013) 
 
Histone deacetylase 2
Name:Histone deacetylase 2
Type:Chromatin regulator; hydrolase; repressor
Mol. Mass.:55356.54
Organism:Homo sapiens (Human)
Description:Q92769
Residue:488
BDBM19149
NameBDBM19149
Synonyms:CHEMBL98 SAHA US10188756, Compound SAHA US11505523, Compound SAHA US9353061, SAHA US9695181, Vorinostat Zolinza suberoylanilide hydroxamic acid
TypeSmall organic molecule
Emp. Form.C14H20N2O3
Mol. Mass.264.3202
SMILESONC(=O)CCCCCCC(=O)Nc1ccccc1