Reaction Details
TargetVascular endothelial growth factor receptor 2
LigandBDBM106560
Substrate/Competitorn/a
Meas. Tech.Inhibition Assay (KDR)
IC50 4500±n/a nM
Citation Singh, JGhosh, SKluge, AFPetter, RC Heterocyclic compounds and uses thereof US Patent US8586600 Publication Date 11/19/2013
 
Vascular endothelial growth factor receptor 2
Name:Vascular endothelial growth factor receptor 2
Type:Receptor Tyrosine Kinase
Mol. Mass.:151510.97
Organism:Homo sapiens (Human)
Description:P35968
Residue:1356
BDBM106560
NameBDBM106560
Synonyms:US8586600, II-55
TypeSmall organic molecule
Emp. Form.C30H28F3N7O2
Mol. Mass.575.5842
SMILESCN(C)C\C=C\C(=O)Nc1ccc(cc1C(F)(F)F)C(=O)Nc1ccc(C)c(Nc2nccc(n2)-c2cccnc2)c1