Reaction Details
TargetPlatelet-derived growth factor receptor alpha
LigandBDBM106567
Substrate/Competitorn/a
Meas. Tech.Inhibition Assay (PDGFR)
IC50 172.94±0.0 nM
Citation Singh, JGhosh, SKluge, AFPetter, RC Heterocyclic compounds and uses thereof US Patent US8586600 Publication Date 11/19/2013
 
Platelet-derived growth factor receptor alpha
Name:Platelet-derived growth factor receptor alpha
Type:Protein
Mol. Mass.:122633.38
Organism:Homo sapiens (Human)
Description:P16234
Residue:1089
BDBM106567
NameBDBM106567
Synonyms:US8586600, II-1
TypeSmall organic molecule
Emp. Form.C26H22N6O2
Mol. Mass.450.4919
SMILESCc1ccc(NC(=O)c2ccc(NC(=O)C=C)cc2)cc1Nc1nccc(n1)-c1cccnc1