Reaction Details
TargetPlatelet-derived growth factor receptor alpha
LigandBDBM106563
Substrate/Competitorn/a
Meas. Tech.Inhibition Assay (PDGFR)
IC50 29.8±0.0 nM
Citation Singh, JGhosh, SKluge, AFPetter, RC Heterocyclic compounds and uses thereof US Patent US8586600 Publication Date 11/19/2013
 
Platelet-derived growth factor receptor alpha
Name:Platelet-derived growth factor receptor alpha
Type:Protein
Mol. Mass.:122633.38
Organism:Homo sapiens (Human)
Description:P16234
Residue:1089
BDBM106563
NameBDBM106563
Synonyms:US8586600, II-6
TypeSmall organic molecule
Emp. Form.C27H24N6O2
Mol. Mass.464.5185
SMILESCc1ccc(NC(=O)c2ccc(CNC(=O)C=C)cc2)cc1Nc1nccc(n1)-c1cccnc1