Reaction Details
TargetPlatelet-derived growth factor receptor alpha
LigandBDBM106568
Substrate/Competitorn/a
Meas. Tech.Inhibition Assay (PDGFR)
IC50 10.69±0.0 nM
Citation Singh, JGhosh, SKluge, AFPetter, RC Heterocyclic compounds and uses thereof US Patent US8586600 Publication Date 11/19/2013
 
Platelet-derived growth factor receptor alpha
Name:Platelet-derived growth factor receptor alpha
Type:Protein
Mol. Mass.:122633.38
Organism:Homo sapiens (Human)
Description:P16234
Residue:1089
BDBM106568
NameBDBM106568
Synonyms:US8586600, II-8
TypeSmall organic molecule
Emp. Form.C28H22N6O3
Mol. Mass.490.5127
SMILESCc1ccc(NC(=O)c2ccc(CN3C(=O)C=CC3=O)cc2)cc1Nc1nccc(n1)-c1cccnc1