Reaction Details
TargetPlatelet-derived growth factor receptor alpha
LigandBDBM106564
Substrate/Competitorn/a
Meas. Tech.Inhibition Assay (PDGFR)
IC50 18.8±0.0 nM
Citation Singh, JGhosh, SKluge, AFPetter, RC Heterocyclic compounds and uses thereof US Patent US8586600 Publication Date 11/19/2013
 
Platelet-derived growth factor receptor alpha
Name:Platelet-derived growth factor receptor alpha
Type:Protein
Mol. Mass.:122633.38
Organism:Homo sapiens (Human)
Description:P16234
Residue:1089
BDBM106564
NameBDBM106564
Synonyms:US8586600, II-23
TypeSmall organic molecule
Emp. Form.C25H22N6O3S
Mol. Mass.486.546
SMILESCc1ccc(NC(=O)c2ccc(NS(=O)(=O)C=C)cc2)cc1Nc1nccc(n1)-c1cccnc1