Reaction Details
TargetPlatelet-derived growth factor receptor alpha
LigandBDBM106565
Substrate/Competitorn/a
Meas. Tech.Inhibition Assay (PDGFR)
IC50 7.9±0.0 nM
Citation Singh, JGhosh, SKluge, AFPetter, RC Heterocyclic compounds and uses thereof US Patent US8586600 Publication Date 11/19/2013
 
Platelet-derived growth factor receptor alpha
Name:Platelet-derived growth factor receptor alpha
Type:Protein
Mol. Mass.:122633.38
Organism:Homo sapiens (Human)
Description:P16234
Residue:1089
BDBM106565
NameBDBM106565
Synonyms:US8586600, II-45
TypeSmall organic molecule
Emp. Form.C29H26N6O2
Mol. Mass.490.5557
SMILESCc1ccc(NC(=O)c2ccc3CN(CCc3c2)C(=O)C=C)cc1Nc1nccc(n1)-c1cccnc1