Reaction Details
TargetPlatelet-derived growth factor receptor alpha
LigandBDBM106566
Substrate/Competitorn/a
Meas. Tech.Inhibition Assay (PDGFR)
IC50 1017±0.0 nM
Citation Singh, JGhosh, SKluge, AFPetter, RC Heterocyclic compounds and uses thereof US Patent US8586600 Publication Date 11/19/2013
 
Platelet-derived growth factor receptor alpha
Name:Platelet-derived growth factor receptor alpha
Type:Protein
Mol. Mass.:122633.38
Organism:Homo sapiens (Human)
Description:P16234
Residue:1089
BDBM106566
NameBDBM106566
Synonyms:US8586600, II-52
TypeSmall organic molecule
Emp. Form.C27H24N6O2
Mol. Mass.464.5185
SMILESCc1cc(nc(Nc2cc(NC(=O)c3ccc(NC(=O)C=C)cc3)ccc2C)n1)-c1cccnc1