Reaction Details
TargetPlatelet-derived growth factor receptor alpha
LigandBDBM106559
Substrate/Competitorn/a
Meas. Tech.Inhibition Assay (PDGFR)
IC50 184.8±0.0 nM
Citation Singh, JGhosh, SKluge, AFPetter, RC Heterocyclic compounds and uses thereof US Patent US8586600 Publication Date 11/19/2013
 
Platelet-derived growth factor receptor alpha
Name:Platelet-derived growth factor receptor alpha
Type:Protein
Mol. Mass.:122633.38
Organism:Homo sapiens (Human)
Description:P16234
Residue:1089
BDBM106559
NameBDBM106559
Synonyms:US8586600, II-54
TypeSmall organic molecule
Emp. Form.C26H23ClN6O2
Mol. Mass.486.953
SMILESCC(Cl)C(=O)Nc1ccc(cc1)C(=O)Nc1ccc(C)c(Nc2nccc(n2)-c2cccnc2)c1