Reaction Details
TargetPlatelet-derived growth factor receptor alpha
LigandBDBM106561
Substrate/Competitorn/a
Meas. Tech.Inhibition Assay (PDGFR)
IC50 5.90±0.0 nM
Citation Singh, JGhosh, SKluge, AFPetter, RC Heterocyclic compounds and uses thereof US Patent US8586600 Publication Date 11/19/2013
 
Platelet-derived growth factor receptor alpha
Name:Platelet-derived growth factor receptor alpha
Type:Protein
Mol. Mass.:122633.38
Organism:Homo sapiens (Human)
Description:P16234
Residue:1089
BDBM106561
NameBDBM106561
Synonyms:US8586600, III-6
TypeSmall organic molecule
Emp. Form.C30H28F3N7O2
Mol. Mass.575.5842
SMILESCN(C)C\C=C\C(=O)Nc1ccc(NC(=O)c2ccc(C)c(Nc3nccc(n3)-c3cccnc3)c2)cc1C(F)(F)F