Reaction Details
TargetMast/stem cell growth factor receptor Kit
LigandBDBM106553
Substrate/Competitorn/a
Meas. Tech.Inhibition Assay (c-Kit)
IC50 83±0.0 nM
Citation Singh, JGhosh, SKluge, AFPetter, RC Heterocyclic compounds and uses thereof US Patent US8586600 Publication Date 11/19/2013
 
Mast/stem cell growth factor receptor Kit
Name:Mast/stem cell growth factor receptor Kit
Type:Protein
Mol. Mass.:109869.37
Organism:Homo sapiens (Human)
Description:P10721
Residue:976
BDBM106553
NameBDBM106553
Synonyms:US8586600, II-2
TypeSmall organic molecule
Emp. Form.C27H21F3N6O2
Mol. Mass.518.4898
SMILESCc1ccc(NC(=O)c2ccc(NC(=O)C=C)c(c2)C(F)(F)F)cc1Nc1nccc(n1)-c1cccnc1