Reaction Details
TargetMast/stem cell growth factor receptor Kit
LigandBDBM106555
Substrate/Competitorn/a
Meas. Tech.Inhibition Assay (c-Kit)
IC50 10000±0.0 nM
Citation Singh, JGhosh, SKluge, AFPetter, RC Heterocyclic compounds and uses thereof US Patent US8586600 Publication Date 11/19/2013
 
Mast/stem cell growth factor receptor Kit
Name:Mast/stem cell growth factor receptor Kit
Type:Protein
Mol. Mass.:109869.37
Organism:Homo sapiens (Human)
Description:P10721
Residue:976
BDBM106555
NameBDBM106555
Synonyms:US8586600, II-40
TypeSmall organic molecule
Emp. Form.C28H22ClN7O3S
Mol. Mass.572.037
SMILESCc1ccc(NC(=O)c2ccc(NS(=O)(=O)c3cnccc3Cl)cc2)cc1Nc1nccc(n1)-c1cccnc1