Reaction Details
TargetMast/stem cell growth factor receptor Kit
LigandBDBM106559
Substrate/Competitorn/a
Meas. Tech.Inhibition Assay (c-Kit)
IC50 10000±0.0 nM
Citation Singh, JGhosh, SKluge, AFPetter, RC Heterocyclic compounds and uses thereof US Patent US8586600 Publication Date 11/19/2013
 
Mast/stem cell growth factor receptor Kit
Name:Mast/stem cell growth factor receptor Kit
Type:Protein
Mol. Mass.:109869.37
Organism:Homo sapiens (Human)
Description:P10721
Residue:976
BDBM106559
NameBDBM106559
Synonyms:US8586600, II-54
TypeSmall organic molecule
Emp. Form.C26H23ClN6O2
Mol. Mass.486.953
SMILESCC(Cl)C(=O)Nc1ccc(cc1)C(=O)Nc1ccc(C)c(Nc2nccc(n2)-c2cccnc2)c1