Reaction Details
TargetMast/stem cell growth factor receptor Kit
LigandBDBM106560
Substrate/Competitorn/a
Meas. Tech.Inhibition Assay (c-Kit)
IC50 9151±0.0 nM
Citation Singh, JGhosh, SKluge, AFPetter, RC Heterocyclic compounds and uses thereof US Patent US8586600 Publication Date 11/19/2013
 
Mast/stem cell growth factor receptor Kit
Name:Mast/stem cell growth factor receptor Kit
Type:Protein
Mol. Mass.:109869.37
Organism:Homo sapiens (Human)
Description:P10721
Residue:976
BDBM106560
NameBDBM106560
Synonyms:US8586600, II-55
TypeSmall organic molecule
Emp. Form.C30H28F3N7O2
Mol. Mass.575.5842
SMILESCN(C)C\C=C\C(=O)Nc1ccc(cc1C(F)(F)F)C(=O)Nc1ccc(C)c(Nc2nccc(n2)-c2cccnc2)c1