Reaction Details
TargetMast/stem cell growth factor receptor Kit
LigandBDBM106561
Substrate/Competitorn/a
Meas. Tech.Inhibition Assay (c-Kit)
IC50 3989±0.0 nM
Citation Singh, JGhosh, SKluge, AFPetter, RC Heterocyclic compounds and uses thereof US Patent US8586600 Publication Date 11/19/2013
 
Mast/stem cell growth factor receptor Kit
Name:Mast/stem cell growth factor receptor Kit
Type:Protein
Mol. Mass.:109869.37
Organism:Homo sapiens (Human)
Description:P10721
Residue:976
BDBM106561
NameBDBM106561
Synonyms:US8586600, III-6
TypeSmall organic molecule
Emp. Form.C30H28F3N7O2
Mol. Mass.575.5842
SMILESCN(C)C\C=C\C(=O)Nc1ccc(NC(=O)c2ccc(C)c(Nc3nccc(n3)-c3cccnc3)c2)cc1C(F)(F)F