Reaction Details
TargetMast/stem cell growth factor receptor Kit
LigandBDBM106562
Substrate/Competitorn/a
Meas. Tech.Inhibition Assay (c-Kit)
IC50 205±0.0 nM
Citation Singh, JGhosh, SKluge, AFPetter, RC Heterocyclic compounds and uses thereof US Patent US8586600 Publication Date 11/19/2013
 
Mast/stem cell growth factor receptor Kit
Name:Mast/stem cell growth factor receptor Kit
Type:Protein
Mol. Mass.:109869.37
Organism:Homo sapiens (Human)
Description:P10721
Residue:976
BDBM106562
NameBDBM106562
Synonyms:US8586600, III-14
TypeSmall organic molecule
Emp. Form.C26H20ClF3N6O2
Mol. Mass.540.924
SMILESCc1ccc(cc1Nc1nccc(n1)-c1cccnc1)C(=O)Nc1ccc(NC(=O)CCl)c(c1)C(F)(F)F