Reaction Details
TargetVascular endothelial growth factor receptor 2
LigandBDBM106553
Substrate/Competitorn/a
Meas. Tech.Inhibition Assay (KDR)
IC50 3.0e+3±n/a nM
Citation Singh, JGhosh, SKluge, AFPetter, RC Heterocyclic compounds and uses thereof US Patent US8586600 Publication Date 11/19/2013
 
Vascular endothelial growth factor receptor 2
Name:Vascular endothelial growth factor receptor 2
Type:Receptor Tyrosine Kinase
Mol. Mass.:151510.97
Organism:Homo sapiens (Human)
Description:P35968
Residue:1356
BDBM106553
NameBDBM106553
Synonyms:US8586600, II-2
TypeSmall organic molecule
Emp. Form.C27H21F3N6O2
Mol. Mass.518.4898
SMILESCc1ccc(NC(=O)c2ccc(NC(=O)C=C)c(c2)C(F)(F)F)cc1Nc1nccc(n1)-c1cccnc1