Reaction Details
TargetVascular endothelial growth factor receptor 2
LigandBDBM106564
Substrate/Competitorn/a
Meas. Tech.Inhibition Assay (KDR)
IC50 2.2e+3±n/a nM
Citation Singh, JGhosh, SKluge, AFPetter, RC Heterocyclic compounds and uses thereof US Patent US8586600 Publication Date 11/19/2013
 
Vascular endothelial growth factor receptor 2
Name:Vascular endothelial growth factor receptor 2
Type:Receptor Tyrosine Kinase
Mol. Mass.:151510.97
Organism:Homo sapiens (Human)
Description:P35968
Residue:1356
BDBM106564
NameBDBM106564
Synonyms:US8586600, II-23
TypeSmall organic molecule
Emp. Form.C25H22N6O3S
Mol. Mass.486.546
SMILESCc1ccc(NC(=O)c2ccc(NS(=O)(=O)C=C)cc2)cc1Nc1nccc(n1)-c1cccnc1