Reaction Details
TargetVascular endothelial growth factor receptor 2
LigandBDBM106565
Substrate/Competitorn/a
Meas. Tech.Inhibition Assay (KDR)
IC50 1.00e+4±n/a nM
Citation Singh, JGhosh, SKluge, AFPetter, RC Heterocyclic compounds and uses thereof US Patent US8586600 Publication Date 11/19/2013
 
Vascular endothelial growth factor receptor 2
Name:Vascular endothelial growth factor receptor 2
Type:Receptor Tyrosine Kinase
Mol. Mass.:151510.97
Organism:Homo sapiens (Human)
Description:P35968
Residue:1356
BDBM106565
NameBDBM106565
Synonyms:US8586600, II-45
TypeSmall organic molecule
Emp. Form.C29H26N6O2
Mol. Mass.490.5557
SMILESCc1ccc(NC(=O)c2ccc3CN(CCc3c2)C(=O)C=C)cc1Nc1nccc(n1)-c1cccnc1