Reaction Details
TargetVascular endothelial growth factor receptor 2
LigandBDBM106566
Substrate/Competitorn/a
Meas. Tech.Inhibition Assay (KDR)
IC50 3.0e+3±n/a nM
Citation Singh, JGhosh, SKluge, AFPetter, RC Heterocyclic compounds and uses thereof US Patent US8586600 Publication Date 11/19/2013
 
Vascular endothelial growth factor receptor 2
Name:Vascular endothelial growth factor receptor 2
Type:Receptor Tyrosine Kinase
Mol. Mass.:151510.97
Organism:Homo sapiens (Human)
Description:P35968
Residue:1356
BDBM106566
NameBDBM106566
Synonyms:US8586600, II-52
TypeSmall organic molecule
Emp. Form.C27H24N6O2
Mol. Mass.464.5185
SMILESCc1cc(nc(Nc2cc(NC(=O)c3ccc(NC(=O)C=C)cc3)ccc2C)n1)-c1cccnc1