Reaction Details
TargetVascular endothelial growth factor receptor 2
LigandBDBM106561
Substrate/Competitorn/a
Meas. Tech.Inhibition Assay (KDR)
IC50 8.1e+3±n/a nM
Citation Singh, JGhosh, SKluge, AFPetter, RC Heterocyclic compounds and uses thereof US Patent US8586600 Publication Date 11/19/2013
 
Vascular endothelial growth factor receptor 2
Name:Vascular endothelial growth factor receptor 2
Type:Receptor Tyrosine Kinase
Mol. Mass.:151510.97
Organism:Homo sapiens (Human)
Description:P35968
Residue:1356
BDBM106561
NameBDBM106561
Synonyms:US8586600, III-6
TypeSmall organic molecule
Emp. Form.C30H28F3N7O2
Mol. Mass.575.5842
SMILESCN(C)C\C=C\C(=O)Nc1ccc(NC(=O)c2ccc(C)c(Nc3nccc(n3)-c3cccnc3)c2)cc1C(F)(F)F