Reaction Details
TargetVascular endothelial growth factor receptor 2
LigandBDBM106562
Substrate/Competitorn/a
Meas. Tech.Inhibition Assay (KDR)
IC50 2.1e+3±n/a nM
Citation Singh, JGhosh, SKluge, AFPetter, RC Heterocyclic compounds and uses thereof US Patent US8586600 Publication Date 11/19/2013
 
Vascular endothelial growth factor receptor 2
Name:Vascular endothelial growth factor receptor 2
Type:Receptor Tyrosine Kinase
Mol. Mass.:151510.97
Organism:Homo sapiens (Human)
Description:P35968
Residue:1356
BDBM106562
NameBDBM106562
Synonyms:US8586600, III-14
TypeSmall organic molecule
Emp. Form.C26H20ClF3N6O2
Mol. Mass.540.924
SMILESCc1ccc(cc1Nc1nccc(n1)-c1cccnc1)C(=O)Nc1ccc(NC(=O)CCl)c(c1)C(F)(F)F