Reaction Details
TargetRetinol-binding protein 4
LigandBDBM106685
Substrate/Competitorn/a
Meas. Tech.Binding Assay
IC50 10±0.0 nM
Citation Kasai, SKaku, TKamaura, M Heterocyclic compound US Patent US8586571 Publication Date 11/19/2013
 
Retinol-binding protein 4
Name:Retinol-binding protein 4
Type:Protein
Mol. Mass.:23008.75
Organism:Homo sapiens (Human)
Description:P02753
Residue:201
BDBM106685
NameBDBM106685
Synonyms:US8586571, 17
TypeSmall organic molecule
Emp. Form.C19H22N2OS
Mol. Mass.326.456
SMILESCC(C)(C)c1ccccc1SC1CN(C1)C(=O)c1ccccn1