Reaction Details
TargetNitric oxide synthase, inducible
LigandBDBM106699
Substrate/Competitorn/a
Meas. Tech.Enzyme Assay
IC50 5.8e+4±n/a nM
Citation Maddaford, SRamnauth, JRakhit, SPatman, JRenton, PAnnedi, SC Substituted indole compounds having NOS inhibitory activity US Patent US8586620 Publication Date 11/19/2013
 
Nitric oxide synthase, inducible
Name:Nitric oxide synthase, inducible
Type:Homodimer
Mol. Mass.:131141.95
Organism:Homo sapiens (Human)
Description:P35228
Residue:1153
BDBM106699
NameBDBM106699
Synonyms:CHEMBL1957350 | US8586620, 46
TypeSmall organic molecule
Emp. Form.C19H20N4O
Mol. Mass.320.3883
SMILESCN1CCC(=CC1)c1c[nH]c2ccc(cc12)N=C(N)c1ccco1