Reaction Details
Target5-hydroxytryptamine 1D receptor
LigandBDBM106699
Substrate/Competitorn/a
Meas. Tech.Binding Assay
IC50 50±n/a nM
Citation Maddaford, SRamnauth, JRakhit, SPatman, JRenton, PAnnedi, SC Substituted indole compounds having NOS inhibitory activity US Patent US8586620 Publication Date 11/19/2013
 
5-hydroxytryptamine 1D receptor
Name:5-hydroxytryptamine 1D receptor
Type:Protein
Mol. Mass.:12731.52
Organism:Bos taurus (Bovine)
Description:Q8MI13
Residue:119
BDBM106699
NameBDBM106699
Synonyms:CHEMBL1957350 | US8586620, 46
TypeSmall organic molecule
Emp. Form.C19H20N4O
Mol. Mass.320.3883
SMILESCN1CCC(=CC1)c1c[nH]c2ccc(cc12)N=C(N)c1ccco1