Reaction Details
TargetSerine/threonine-protein kinase pim-2
LigandBDBM106896
Substrate/Competitorn/a
Meas. Tech.ATP Depletion Assay
pH7.5±0
IC50 1±n/a nM
Citation Burger, MTHan, WLan, JNishiguchi, G Kinase inhibitors and methods of their use US Patent US8592455 Publication Date 11/26/2013
 
Serine/threonine-protein kinase pim-2
Name:Serine/threonine-protein kinase pim-2
Type:Serine/threonine-protein kinase
Mol. Mass.:34185.93
Organism:Homo sapiens (Human)
Description:Q9P1W9
Residue:311
BDBM106896
NameBDBM106896
Synonyms:US8592455, 96
TypeSmall organic molecule
Emp. Form.C23H22F3N5O2
Mol. Mass.457.4483
SMILESC[C@H]1CN(C[C@@H](N)[C@@H]1O)c1ccncc1NC(=O)c1ccc(F)c(n1)-c1c(F)cccc1F