Reaction Details
TargetSerine/threonine-protein kinase pim-3
LigandBDBM106803
Substrate/Competitorn/a
Meas. Tech.ATP Depletion Assay
pH7.5±0
IC50 1±n/a nM
Citation Burger, MTHan, WLan, JNishiguchi, G Kinase inhibitors and methods of their use US Patent US8592455 Publication Date 11/26/2013
 
Serine/threonine-protein kinase pim-3
Name:Serine/threonine-protein kinase pim-3
Type:Protein
Mol. Mass.:35888.19
Organism:Homo sapiens (Human)
Description:Q86V86
Residue:326
BDBM106803
NameBDBM106803
Synonyms:US8592455, 3
TypeSmall organic molecule
Emp. Form.C23H23F3N6O2
Mol. Mass.472.4629
SMILESC[C@H]1CN(C[C@@H](N)[C@@H]1O)c1ccncc1NC(=O)c1nc(c(F)cc1N)-c1c(F)cccc1F