Reaction Details
TargetKininogen-1
LigandBDBM107193
Substrate/Competitorn/a
Meas. Tech.Binding Assay
Ki 4.0±n/a nM
Citation Aebi, JBinggeli, AHertel, CKonkar, AAKuehne, HKuhn, BMaerki, HPWang, H Aryl-benzocycloalkyl amide derivatives US Patent US8592426 Publication Date 11/26/2013
 
Kininogen-1
Name:Kininogen-1
Type:Enzyme
Mol. Mass.:71962.11
Organism:Homo sapiens (Human)
Description:P01042
Residue:644
BDBM107193
NameBDBM107193
Synonyms:US8592426, 42
TypeSmall organic molecule
Emp. Form.C27H23ClFN7O4
Mol. Mass.563.967
SMILESCOc1ncc(cn1)C(=O)NC1(CC1)C(=O)NC1CCc2cc(cnc12)-c1cc(Cl)cc(F)c1-c1noc(C)n1