Reaction Details
TargetKininogen-1
LigandBDBM107166
Substrate/Competitorn/a
Meas. Tech.Calcium Mobilization Assay
IC50 24.6±n/a nM
Citation Aebi, JBinggeli, AHertel, CKonkar, AAKuehne, HKuhn, BMaerki, HPWang, H Aryl-benzocycloalkyl amide derivatives US Patent US8592426 Publication Date 11/26/2013
 
Kininogen-1
Name:Kininogen-1
Type:Enzyme
Mol. Mass.:71962.11
Organism:Homo sapiens (Human)
Description:P01042
Residue:644
BDBM107166
NameBDBM107166
Synonyms:US8592426, 15
TypeSmall organic molecule
Emp. Form.C23H19ClF4N6O3
Mol. Mass.538.882
SMILESCn1nnc(n1)-c1c(F)cc(Cl)cc1-c1ccc2C(CCOc2c1)NC(=O)C1(CC1)NC(=O)C(F)(F)F