Reaction Details
TargetKininogen-1
LigandBDBM107168
Substrate/Competitorn/a
Meas. Tech.Calcium Mobilization Assay
IC50 0.6±n/a nM
Citation Aebi, JBinggeli, AHertel, CKonkar, AAKuehne, HKuhn, BMaerki, HPWang, H Aryl-benzocycloalkyl amide derivatives US Patent US8592426 Publication Date 11/26/2013
 
Kininogen-1
Name:Kininogen-1
Type:Enzyme
Mol. Mass.:71962.11
Organism:Homo sapiens (Human)
Description:P01042
Residue:644
BDBM107168
NameBDBM107168
Synonyms:US8592426, 17
TypeSmall organic molecule
Emp. Form.C25H21ClF4N4O3
Mol. Mass.536.906
SMILESCc1nc(no1)-c1c(F)cc(Cl)cc1-c1ccc2c(CCC2(C)NC(=O)C2(CC2)NC(=O)C(F)(F)F)c1