Reaction Details
TargetKininogen-1
LigandBDBM107177
Substrate/Competitorn/a
Meas. Tech.Calcium Mobilization Assay
IC50 0.2±n/a nM
Citation Aebi, JBinggeli, AHertel, CKonkar, AAKuehne, HKuhn, BMaerki, HPWang, H Aryl-benzocycloalkyl amide derivatives US Patent US8592426 Publication Date 11/26/2013
 
Kininogen-1
Name:Kininogen-1
Type:Enzyme
Mol. Mass.:71962.11
Organism:Homo sapiens (Human)
Description:P01042
Residue:644
BDBM107177
NameBDBM107177
Synonyms:US8592426, 26
Typen/a
Emp. Form.C28H24ClFN6O4
Mol. Mass.562.979
SMILESCOc1ncc(cn1)C(=O)NC1(CC1)C(=O)N[C@H]1CCc2cc(ccc12)-c1cc(Cl)cc(F)c1-c1noc(C)n1