Reaction Details
TargetKininogen-1
LigandBDBM107179
Substrate/Competitorn/a
Meas. Tech.Calcium Mobilization Assay
IC50 0.3±n/a nM
Citation Aebi, JBinggeli, AHertel, CKonkar, AAKuehne, HKuhn, BMaerki, HPWang, H Aryl-benzocycloalkyl amide derivatives US Patent US8592426 Publication Date 11/26/2013
 
Kininogen-1
Name:Kininogen-1
Type:Enzyme
Mol. Mass.:71962.11
Organism:Homo sapiens (Human)
Description:P01042
Residue:644
BDBM107179
NameBDBM107179
Synonyms:US8592426, 28
Typen/a
Emp. Form.C26H21ClFN5O4
Mol. Mass.521.927
SMILESCc1nc(no1)-c1c(F)cc(Cl)cc1-c1ccc2[C@H](CCc2c1)NC(=O)C1(CC1)NC(=O)c1ccno1