Reaction Details
TargetKiSS-1 receptor
LigandBDBM107307
Substrate/Competitorn/a
Meas. Tech.Binding Assay
IC50 0.12±0.0 nM
Citation Fujii, NOishi, STomita, K Metastin derivative and use thereof US Patent US8592379 Publication Date 11/26/2013
 
KiSS-1 receptor
Name:KiSS-1 receptor
Type:G Protein-Coupled Receptor (GPCR)
Mol. Mass.:42613.79
Organism:Homo sapiens (Human)
Description:Binding assay was performed using membranes from the CHO cell transfectants.
Residue:398
BDBM107307
NameBDBM107307
Synonyms:US8592379, 19
TypeSmall organic molecule
Emp. Form.C11H21NO
Mol. Mass.183.2905
SMILESCNC\C=C\[C@@H](CC(C)C)C(C)=O