Reaction Details
TargetAcetyl-coenzyme A transporter 1
LigandBDBM107350
Substrate/Competitorn/a
Meas. Tech.Binding Assay
pH7.4±0
IC50 1.3±0.0 nM
Citation Maekawa, TIgawa, H Fused ring compound and use thereof US Patent US8592431 Publication Date 11/26/2013
 
Acetyl-coenzyme A transporter 1
Name:Acetyl-coenzyme A transporter 1
Type:Enzyme
Mol. Mass.:60911.27
Organism:Homo sapiens (Human)
Description:O00400
Residue:549
BDBM107350
NameBDBM107350
Synonyms:US8592431, 138
TypeSmall organic molecule
Emp. Form.C31H34N6O4
Mol. Mass.554.6395
SMILESCCCCc1c(Cc2ccc(cc2)-c2ccccc2-c2nc(=O)o[nH]2)c(=O)n([C@H]2C[C@H](C)O[C@H](C)C2)c2ncnn12