Reaction Details
TargetAcetyl-coenzyme A transporter 1
LigandBDBM107381
Substrate/Competitorn/a
Meas. Tech.Binding Assay
pH7.4±0
IC50 1.6±0.0 nM
Citation Maekawa, TIgawa, H Fused ring compound and use thereof US Patent US8592431 Publication Date 11/26/2013
 
Acetyl-coenzyme A transporter 1
Name:Acetyl-coenzyme A transporter 1
Type:Enzyme
Mol. Mass.:60911.27
Organism:Homo sapiens (Human)
Description:O00400
Residue:549
BDBM107381
NameBDBM107381
Synonyms:US8592431, 191
TypeSmall organic molecule
Emp. Form.C31H32N6O4
Mol. Mass.552.6236
SMILESCCCc1c(Cc2ccc(cc2)-c2ccccc2-c2nc(=O)o[nH]2)c(=O)n(C2CCC(CC2)=CCO)c2ncnn12