Reaction Details
TargetAcetyl-coenzyme A transporter 1
LigandBDBM107454
Substrate/Competitorn/a
Meas. Tech.Binding Assay
pH7.4±0
IC50 1.6±0.0 nM
Citation Maekawa, TIgawa, H Fused ring compound and use thereof US Patent US8592431 Publication Date 11/26/2013
 
Acetyl-coenzyme A transporter 1
Name:Acetyl-coenzyme A transporter 1
Type:Enzyme
Mol. Mass.:60911.27
Organism:Homo sapiens (Human)
Description:O00400
Residue:549
BDBM107454
NameBDBM107454
Synonyms:US8592431, 413
TypeSmall organic molecule
Emp. Form.C34H39N5O5
Mol. Mass.597.704
SMILESCCCc1c(Cc2ccc(cc2)-c2ccccc2-c2nc(=O)o[nH]2)c(=O)n([C@H]2CC[C@@H](CC2)OCC(C)(C)O)c2ccnn12