Reaction Details
TargetAcetyl-coenzyme A transporter 1
LigandBDBM107460
Substrate/Competitorn/a
Meas. Tech.Binding Assay
pH7.4±0
IC50 1.7±0.0 nM
Citation Maekawa, TIgawa, H Fused ring compound and use thereof US Patent US8592431 Publication Date 11/26/2013
 
Acetyl-coenzyme A transporter 1
Name:Acetyl-coenzyme A transporter 1
Type:Enzyme
Mol. Mass.:60911.27
Organism:Homo sapiens (Human)
Description:O00400
Residue:549
BDBM107460
NameBDBM107460
Synonyms:US8592431, 435
TypeSmall organic molecule
Emp. Form.C34H38FN5O5
Mol. Mass.615.6944
SMILESCCCc1c(Cc2ccc(cc2F)-c2ccccc2-c2nc(=O)o[nH]2)c(=O)n(C2CC[C@@H](CC2)OCC(C)(C)O)c2ccnn12