Reaction Details
TargetD(3) dopamine receptor
LigandBDBM107516
Substrate/Competitorn/a
Meas. Tech.Biochemical Assay
Ki 1.19±0.0 nM
Citation Rodriguez Sarmiento, RMWichmann, J Benzodioxole piperidine compounds US Patent US8598357 Publication Date 12/3/2013
 
D(3) dopamine receptor
Name:D(3) dopamine receptor
Type:n/a
Mol. Mass.:44243.43
Organism:Homo sapiens (Human)
Description:n/a
Residue:400
BDBM107516
NameBDBM107516
Synonyms:US8598357, 19
TypeSmall organic molecule
Emp. Form.C26H35N3O4
Mol. Mass.453.5738
SMILESCc1cc(CC(=O)N[C@H]2CC[C@H](CCN3CCC(CC3)c3cccc4OCOc34)CC2)on1