Reaction Details
Target11-beta-hydroxysteroid dehydrogenase 1
LigandBDBM107640
Substrate/Competitorn/a
Meas. Tech.Biological Assay Example 1
IC50 1.59±0.0 nM
Citation Renz, MSchuehle, MXu, Z Cyclic inhibitors of 11beta-hydroxysteroid dehydrogenase 1 US Patent US8575157 Publication Date 11/5/2013
 
11-beta-hydroxysteroid dehydrogenase 1
Name:11-beta-hydroxysteroid dehydrogenase 1
Type:Enzyme
Mol. Mass.:32409.16
Organism:Homo sapiens (Human)
Description:P28845
Residue:292
BDBM107640
NameBDBM107640
Synonyms:US8575157, 3
TypeSmall organic molecule
Emp. Form.C30H34N2O4
Mol. Mass.486.602
SMILESC[C@H](N1CC[C@@](CC(C)(C)O)(OC1=O)c1ccccc1)c1ccc(cc1)-c1ccc(=O)n(c1)C1CC1