Reaction Details
Target11-beta-hydroxysteroid dehydrogenase 1
LigandBDBM107661
Substrate/Competitorn/a
Meas. Tech.Biological Assay Example 1
IC50 1.67±0.0 nM
Citation Renz, MSchuehle, MXu, Z Cyclic inhibitors of 11beta-hydroxysteroid dehydrogenase 1 US Patent US8575157 Publication Date 11/5/2013
 
11-beta-hydroxysteroid dehydrogenase 1
Name:11-beta-hydroxysteroid dehydrogenase 1
Type:Enzyme
Mol. Mass.:32409.16
Organism:Homo sapiens (Human)
Description:P28845
Residue:292
BDBM107661
NameBDBM107661
Synonyms:US8575157, 37
TypeSmall organic molecule
Emp. Form.C28H32N2O4
Mol. Mass.460.5647
SMILESC[C@H](N1CC[C@@](CC(C)(C)O)(OC1=O)c1ccccc1)c1ccc(cc1)-c1ccc(=O)n(C)c1