Reaction Details
Target11-beta-hydroxysteroid dehydrogenase 1
LigandBDBM107609
Substrate/Competitorn/a
Meas. Tech.Biological Assay Example 1
IC50 0.87±0.0 nM
Citation Renz, MSchuehle, MXu, Z Cyclic inhibitors of 11beta-hydroxysteroid dehydrogenase 1 US Patent US8575157 Publication Date 11/5/2013
 
11-beta-hydroxysteroid dehydrogenase 1
Name:11-beta-hydroxysteroid dehydrogenase 1
Type:Enzyme
Mol. Mass.:32409.16
Organism:Homo sapiens (Human)
Description:P28845
Residue:292
BDBM107609
NameBDBM107609
Synonyms:US8575157, 58
TypeSmall organic molecule
Emp. Form.C27H30N2O3
Mol. Mass.430.5387
SMILESCC[C@H](N1CC[C@@](CC)(OC1=O)c1ccccc1)c1ccc(cc1)-c1ccn(C)c(=O)c1