Reaction Details
Target11-beta-hydroxysteroid dehydrogenase 1
LigandBDBM107615
Substrate/Competitorn/a
Meas. Tech.Biological Assay Example 1
IC50 0.80±0.0 nM
Citation Renz, MSchuehle, MXu, Z Cyclic inhibitors of 11beta-hydroxysteroid dehydrogenase 1 US Patent US8575157 Publication Date 11/5/2013
 
11-beta-hydroxysteroid dehydrogenase 1
Name:11-beta-hydroxysteroid dehydrogenase 1
Type:Enzyme
Mol. Mass.:32409.16
Organism:Homo sapiens (Human)
Description:P28845
Residue:292
BDBM107615
NameBDBM107615
Synonyms:US8575157, 65
TypeSmall organic molecule
Emp. Form.C29H34N2O4
Mol. Mass.474.5913
SMILESCCn1ccc(cc1=O)-c1ccc(cc1)[C@H](C)N1CC[C@@](CC(C)(C)O)(OC1=O)c1ccccc1