Reaction Details
Target11-beta-hydroxysteroid dehydrogenase 1
LigandBDBM107619
Substrate/Competitorn/a
Meas. Tech.Biological Assay Example 1
IC50 0.72±0.0 nM
Citation Renz, MSchuehle, MXu, Z Cyclic inhibitors of 11beta-hydroxysteroid dehydrogenase 1 US Patent US8575157 Publication Date 11/5/2013
 
11-beta-hydroxysteroid dehydrogenase 1
Name:11-beta-hydroxysteroid dehydrogenase 1
Type:Enzyme
Mol. Mass.:32409.16
Organism:Homo sapiens (Human)
Description:P28845
Residue:292
BDBM107619
NameBDBM107619
Synonyms:US8575157, 69
TypeSmall organic molecule
Emp. Form.C29H30FN3O3
Mol. Mass.487.5652
SMILESC[C@H](N1CC[C@@](CC(C)(C)C#N)(OC1=O)c1ccc(F)cc1)c1ccc(cc1)-c1ccc(=O)n(C)c1