Reaction Details
Target11-beta-hydroxysteroid dehydrogenase 1
LigandBDBM107667
Substrate/Competitorn/a
Meas. Tech.Biological Assay Example 1
IC50 1.21±0.0 nM
Citation Renz, MSchuehle, MXu, Z Cyclic inhibitors of 11beta-hydroxysteroid dehydrogenase 1 US Patent US8575157 Publication Date 11/5/2013
 
11-beta-hydroxysteroid dehydrogenase 1
Name:11-beta-hydroxysteroid dehydrogenase 1
Type:Enzyme
Mol. Mass.:32409.16
Organism:Homo sapiens (Human)
Description:P28845
Residue:292
BDBM107667
NameBDBM107667
Synonyms:US8575157, 74
TypeSmall organic molecule
Emp. Form.C32H36N2O3
Mol. Mass.496.6398
SMILESCC(C)n1cc(ccc1=O)-c1ccc(cc1)[C@H](C)N1CC[C@@](CC(C)(C)C#C)(OC1=O)c1ccccc1