Reaction Details
Target11-beta-hydroxysteroid dehydrogenase 1
LigandBDBM107670
Substrate/Competitorn/a
Meas. Tech.Biological Assay Example 1
IC50 1.4±0.0 nM
Citation Renz, MSchuehle, MXu, Z Cyclic inhibitors of 11beta-hydroxysteroid dehydrogenase 1 US Patent US8575157 Publication Date 11/5/2013
 
11-beta-hydroxysteroid dehydrogenase 1
Name:11-beta-hydroxysteroid dehydrogenase 1
Type:Enzyme
Mol. Mass.:32409.16
Organism:Homo sapiens (Human)
Description:P28845
Residue:292
BDBM107670
NameBDBM107670
Synonyms:US8575157, 87
TypeSmall organic molecule
Emp. Form.C30H36N2O4
Mol. Mass.488.6178
SMILESCCCn1cc(ccc1=O)-c1ccc(cc1)[C@H](C)N1CC[C@@](CC(C)(C)O)(OC1=O)c1ccccc1