Reaction Details
Target11-beta-hydroxysteroid dehydrogenase 1
LigandBDBM107481
Substrate/Competitorn/a
Meas. Tech.Biological Assay Example 1
IC50 0.77±0.0 nM
Citation Renz, MSchuehle, MXu, Z Cyclic inhibitors of 11beta-hydroxysteroid dehydrogenase 1 US Patent US8575157 Publication Date 11/5/2013
 
11-beta-hydroxysteroid dehydrogenase 1
Name:11-beta-hydroxysteroid dehydrogenase 1
Type:Enzyme
Mol. Mass.:32409.16
Organism:Homo sapiens (Human)
Description:P28845
Residue:292
BDBM107481
NameBDBM107481
Synonyms:US8575157, 189 US8598163, 59
TypeSmall organic molecule
Emp. Form.C24H21F2NO3
Mol. Mass.409.4252
SMILESOCC[C@@]1(CCN(C(=O)O1)c1cccc(c1)-c1ccc(F)cc1F)c1ccccc1