Reaction Details
Target11-beta-hydroxysteroid dehydrogenase 1
LigandBDBM50353386
Substrate/Competitorn/a
Meas. Tech.Biological Assay Example 1
IC50 0.75±0.0 nM
Citation Renz, MSchuehle, MXu, Z Cyclic inhibitors of 11beta-hydroxysteroid dehydrogenase 1 US Patent US8575157 Publication Date 11/5/2013
 
11-beta-hydroxysteroid dehydrogenase 1
Name:11-beta-hydroxysteroid dehydrogenase 1
Type:Enzyme
Mol. Mass.:32409.16
Organism:Homo sapiens (Human)
Description:P28845
Residue:292
BDBM50353386
NameBDBM50353386
Synonyms:CHEMBL1829763 US8592410, Comparator 3 | US8598163, 61
TypeSmall organic molecule
Emp. Form.C26H24F3NO3
Mol. Mass.455.4689
SMILESC[C@H](N1CC[C@@](CCO)(OC1=O)c1ccc(F)cc1)c1ccc(cc1)-c1ccc(F)cc1F