Reaction Details
Target11-beta-hydroxysteroid dehydrogenase 1
LigandBDBM50353390
Substrate/Competitorn/a
Meas. Tech.Biological Assay Example 1
IC50 0.51±0.0 nM
Citation Renz, MSchuehle, MXu, Z Cyclic inhibitors of 11beta-hydroxysteroid dehydrogenase 1 US Patent US8575157 Publication Date 11/5/2013
 
11-beta-hydroxysteroid dehydrogenase 1
Name:11-beta-hydroxysteroid dehydrogenase 1
Type:Enzyme
Mol. Mass.:32409.16
Organism:Homo sapiens (Human)
Description:P28845
Residue:292
BDBM50353390
NameBDBM50353390
Synonyms:CHEMBL1829768 US8592410, Comparator 5 | US8598163, 63
TypeSmall organic molecule
Emp. Form.C26H25F2NO3
Mol. Mass.437.4784
SMILESC[C@H](N1CC[C@@](CCO)(OC1=O)c1ccc(F)cc1)c1ccc(cc1)-c1ccc(F)cc1